Target
Perforin-1
Ligand
BDBM50361404
Substrate
Meas. Tech.
ChEMBL_794525 (CHEMBL1936847)
IC50
1800±n/a nM
Citation
 Spicer, JAHuttunen, KMMiller, CKDenny, WACiccone, ABrowne, KATrapani, JA Inhibition of the pore-forming protein perforin by a series of aryl-substituted isobenzofuran-1(3H)-ones. Bioorg Med Chem 20:1319-36 (2012)  
Target
Name:
Perforin-1
Synonyms:
PERF_HUMAN PRF1
Type:
PROTEIN
Mol. Mass.:
61392.32
Organism:
Homo sapiens (Human)
Description:
ChEMBL_1285138
Residue:
555
  
Inhibitor
Name:
BDBM50361404
Synonyms:
CHEMBL1934368
Type:
Small organic molecule
Emp. Form.:
C18H12N2O3S
Mol. Mass.:
336.364
SMILES:
O=C1NC(=S)NC1=Cc1ccc(cc1)-c1ccc2C(=O)OCc2c1
: