Target
Histone deacetylase 8
Ligand
BDBM50361444
Substrate
Meas. Tech.
ChEMBL_796810 (CHEMBL1943840)
IC50
1760±n/a nM
Citation
 Varasi, MThaler, FAbate, ABigogno, CBoggio, RCarenzi, GCataudella, TDal Zuffo, RFulco, MCRozio, MGMai, ADondio, GMinucci, SMercurio, C Discovery, synthesis, and pharmacological evaluation of spiropiperidine hydroxamic acid based derivatives as structurally novel histone deacetylase (HDAC) inhibitors. J Med Chem 54:3051-64 (2011)  
Target
Name:
Histone deacetylase 8
Synonyms:
HD8 HDAC8_HUMAN Histone deacetylase 8 (HDAC-8) | Human HDAC8
Type:
Enzyme
Mol. Mass.:
41749.60
Organism:
Homo sapiens (Human)
Description:
Q9BY41
Residue:
377
  
Inhibitor
Name:
BDBM50361444
Synonyms:
CHEMBL1938433
Type:
Small organic molecule
Emp. Form.:
C23H24N2O4
Mol. Mass.:
392.4477
SMILES:
ONC(=O)C=Cc1ccc2OC3(CCN(Cc4ccccc4)CC3)CC(=O)c2c1
: