Target
Misshapen-like kinase 1
Ligand
BDBM50361467
Substrate
Meas. Tech.
ChEMBL_797145 (CHEMBL1942372)
IC50
6±n/a nM
Citation
 Millan, DSBunnage, MEBurrows, JLButcher, KJDodd, PGEvans, TJFairman, DAHughes, SJKilty, ICLemaitre, ALewthwaite, RAMahnke, AMathias, JPPhilip, JSmith, RTStefaniak, MHYeadon, MPhillips, C Design and synthesis of inhaled p38 inhibitors for the treatment of chronic obstructive pulmonary disease. J Med Chem 54:7797-814 (2011)  
Target
Name:
Misshapen-like kinase 1
Synonyms:
B55 MAP4K6 MEK kinase kinase 6 MINK MINK1_HUMAN Misshapen/NIK-related kinase Voltage-gated potassium channel subunit Kv7.1/Misshapen-like kinase 1 ZC3
Type:
PROTEIN
Mol. Mass.:
149838.92
Organism:
Homo sapiens (Human)
Description:
ChEMBL_793919
Residue:
1332
  
Inhibitor
Name:
BDBM50361467
Synonyms:
CHEMBL1938400
Type:
Small organic molecule
Emp. Form.:
C35H34ClN7O3S2
Mol. Mass.:
700.273
SMILES:
CC(C)(C)c1cc(NC(=O)NCc2ccccc2Sc2ccc3nnc(-c4ccccc4SCCO)n3c2)n(n1)-c1ccc(O)c(Cl)c1
: