Target
Met repressor
Ligand
BDBM50362001
Substrate
Meas. Tech.
ChEMBL_799628 (CHEMBL1941334)
EC50
61±n/a nM
Citation
 Joce, CWhite, RStockley, PGWarriner, STurnbull, WBNelson, A Design, synthesis and in vitro evaluation of novel bivalent S-adenosylmethionine analogues. Bioorg Med Chem Lett 22:278-84 (2011)  
Target
Name:
Met repressor
Synonyms:
Met regulon regulatory protein MetJ
Type:
PROTEIN
Mol. Mass.:
12138.09
Organism:
Escherichia coli
Description:
ChEMBL_799627
Residue:
105
  
Inhibitor
Name:
BDBM50362001
Synonyms:
CHEMBL1939712
Type:
Small organic molecule
Emp. Form.:
C38H54N16O8
Mol. Mass.:
862.9378
SMILES:
CN(CC[C@H](N)C(=O)NCc1ccc(CNC(=O)[C@@H](N)CCN(C)C[C@H]2O[C@H]([C@H](O)[C@@H]2O)n2cnc3c(N)ncnc23)cc1)C[C@H]1O[C@H]([C@H](O)[C@@H]1O)n1cnc2c(N)ncnc12
: