Target
Diacylglycerol O-acyltransferase 1
Ligand
BDBM50362665
Substrate
Meas. Tech.
ChEMBL_797435 (CHEMBL1943098)
IC50
102±n/a nM
Citation
 Bali, UBarba, ODawson, GGattrell, WTHorswill, JGPan, DAProcter, MJRasamison, CMSambrook Smith, CPTaylor-Warne, AWong-Kai-In, P Design and synthesis of potent carboxylic acid DGAT1 inhibitors with high cell permeability. Bioorg Med Chem Lett 22:824-8 (2012)  
Target
Name:
Diacylglycerol O-acyltransferase 1
Synonyms:
DGAT1_MOUSE Dgat1 Diacylglycerol O-acyltransferase 1 (DGAT1) | Diglyceride acyltransferase
Type:
Enzyme
Mol. Mass.:
56810.61
Organism:
Mus musculus (mouse)
Description:
In this assay, recombinant mouse DGAT-1 containing an N-terminal His6-epitope tag was produced in the baculovirus expression system.
Residue:
498
  
Inhibitor
Name:
BDBM50362665
Synonyms:
CHEMBL1939632
Type:
Small organic molecule
Emp. Form.:
C28H25NO4
Mol. Mass.:
439.5024
SMILES:
CC(C)(COc1ccc(cc1)-c1ccc(NC(=O)c2ccc3ccccc3c2)cc1)C(O)=O
: