Target
Diacylglycerol O-acyltransferase 1
Ligand
BDBM50362678
Substrate
Meas. Tech.
ChEMBL_797432 (CHEMBL1943095)
IC50
11±n/a nM
Citation
 Bali, UBarba, ODawson, GGattrell, WTHorswill, JGPan, DAProcter, MJRasamison, CMSambrook Smith, CPTaylor-Warne, AWong-Kai-In, P Design and synthesis of potent carboxylic acid DGAT1 inhibitors with high cell permeability. Bioorg Med Chem Lett 22:824-8 (2012)  
Target
Name:
Diacylglycerol O-acyltransferase 1
Synonyms:
ACAT-related gene product 1 Acyl coA-diacylglycerol acyl transferase 1 (DGAT1) DGAT1 Diacylglycerol Acyltransferase (DGAT1) Diacylglycerol O-acyltransferase 1 (DGAT1) | Diglyceride acyltransferase
Type:
Protein
Mol. Mass.:
55297.82
Organism:
Homo sapiens (Human)
Description:
O75907
Residue:
488
  
Inhibitor
Name:
BDBM50362678
Synonyms:
CHEMBL1939480
Type:
Small organic molecule
Emp. Form.:
C20H18Cl2N4O3S
Mol. Mass.:
465.353
SMILES:
CCC(Sc1nnc(-c2ccc(NC(=O)c3ccc(Cl)c(Cl)c3)cc2)n1C)C(O)=O
: