Target
Diacylglycerol O-acyltransferase 1
Ligand
BDBM50362671
Substrate
Meas. Tech.
ChEMBL_797432 (CHEMBL1943095)
IC50
110±n/a nM
Citation
 Bali, UBarba, ODawson, GGattrell, WTHorswill, JGPan, DAProcter, MJRasamison, CMSambrook Smith, CPTaylor-Warne, AWong-Kai-In, P Design and synthesis of potent carboxylic acid DGAT1 inhibitors with high cell permeability. Bioorg Med Chem Lett 22:824-8 (2012)  
Target
Name:
Diacylglycerol O-acyltransferase 1
Synonyms:
ACAT-related gene product 1 Acyl coA-diacylglycerol acyl transferase 1 (DGAT1) DGAT1 Diacylglycerol Acyltransferase (DGAT1) Diacylglycerol O-acyltransferase 1 (DGAT1) | Diglyceride acyltransferase
Type:
Protein
Mol. Mass.:
55297.82
Organism:
Homo sapiens (Human)
Description:
O75907
Residue:
488
  
Inhibitor
Name:
BDBM50362671
Synonyms:
CHEMBL1939623
Type:
Small organic molecule
Emp. Form.:
C31H29N5O3
Mol. Mass.:
519.5937
SMILES:
Cn1c(OCC(C)(C)C(=O)Nc2ccccc2)nnc1-c1ccc(NC(=O)c2ccc3ccccc3c2)cc1
: