Target
Transient receptor potential cation channel subfamily A member 1
Ligand
BDBM50362748
Substrate
Meas. Tech.
ChEMBL_798424 (CHEMBL1944172)
IC50
770±n/a nM
Citation
 Gijsen, HJBerthelot, DDe Cleyn, MAGeuens, IBrône, BMercken, M Tricyclic 3,4-dihydropyrimidine-2-thione derivatives as potent TRPA1 antagonists. Bioorg Med Chem Lett 22:797-800 (2012)  
Target
Name:
Transient receptor potential cation channel subfamily A member 1
Synonyms:
ANKTM1 TRPA1 Transformation-sensitive protein p120 | Transient receptor potential cation channel subfamily A member 1 (TRPA1)
Type:
Protein
Mol. Mass.:
127514.20
Organism:
Homo sapiens (Human)
Description:
O75762
Residue:
1119
  
Inhibitor
Name:
BDBM50362748
Synonyms:
CHEMBL1939984
Type:
Small organic molecule
Emp. Form.:
C17H12N2OS
Mol. Mass.:
292.355
SMILES:
O=C1C2[C@H](NC(=S)N=C2c2ccccc12)c1ccccc1
: