Target
Transient receptor potential cation channel subfamily A member 1
Ligand
BDBM50362759
Substrate
Meas. Tech.
ChEMBL_798425 (CHEMBL1944173)
IC50
2700±n/a nM
Citation
 Gijsen, HJBerthelot, DDe Cleyn, MAGeuens, IBrône, BMercken, M Tricyclic 3,4-dihydropyrimidine-2-thione derivatives as potent TRPA1 antagonists. Bioorg Med Chem Lett 22:797-800 (2012)  
Target
Name:
Transient receptor potential cation channel subfamily A member 1
Synonyms:
Anktm1 Trpa1
Type:
PROTEIN
Mol. Mass.:
128622.74
Organism:
Rattus norvegicus
Description:
ChEMBL_1450487
Residue:
1125
  
Inhibitor
Name:
BDBM50362759
Synonyms:
CHEMBL1939974
Type:
Small organic molecule
Emp. Form.:
C19H16N2O3S
Mol. Mass.:
352.407
SMILES:
COc1cccc(C2NC(=S)N=C3C2C(=O)c2ccccc32)c1OC
: