Target
Transient receptor potential cation channel subfamily A member 1
Ligand
BDBM50362743
Substrate
Meas. Tech.
ChEMBL_798425 (CHEMBL1944173)
IC50
500±n/a nM
Citation
 Gijsen, HJBerthelot, DDe Cleyn, MAGeuens, IBrône, BMercken, M Tricyclic 3,4-dihydropyrimidine-2-thione derivatives as potent TRPA1 antagonists. Bioorg Med Chem Lett 22:797-800 (2012)  
Target
Name:
Transient receptor potential cation channel subfamily A member 1
Synonyms:
Anktm1 Trpa1
Type:
PROTEIN
Mol. Mass.:
128622.74
Organism:
Rattus norvegicus
Description:
ChEMBL_1450487
Residue:
1125
  
Inhibitor
Name:
BDBM50362743
Synonyms:
CHEMBL1939823
Type:
Small organic molecule
Emp. Form.:
C21H20N2O4
Mol. Mass.:
364.3945
SMILES:
COCCCOc1cccc(c1)C1NC(=O)N=C2C1C(=O)c1ccccc21
: