Target
Transient receptor potential cation channel subfamily A member 1
Ligand
BDBM50362744
Substrate
Meas. Tech.
ChEMBL_798425 (CHEMBL1944173)
IC50
980±n/a nM
Citation
 Gijsen, HJBerthelot, DDe Cleyn, MAGeuens, IBrône, BMercken, M Tricyclic 3,4-dihydropyrimidine-2-thione derivatives as potent TRPA1 antagonists. Bioorg Med Chem Lett 22:797-800 (2012)  
Target
Name:
Transient receptor potential cation channel subfamily A member 1
Synonyms:
Anktm1 Trpa1
Type:
PROTEIN
Mol. Mass.:
128622.74
Organism:
Rattus norvegicus
Description:
ChEMBL_1450487
Residue:
1125
  
Inhibitor
Name:
BDBM50362744
Synonyms:
CHEMBL1939824
Type:
Small organic molecule
Emp. Form.:
C19H16N2O2S
Mol. Mass.:
336.408
SMILES:
COc1cccc(c1)C1C2C(=O)c3ccccc3C2=NC(=S)N1C
: