Target
Riboflavin-binding protein
Ligand
BDBM22985
Substrate
Meas. Tech.
ChEMBL_800332 (CHEMBL1948178)
pH
7.4±n/a
Kd
2100±n/a nM
Comments
extracted
Citation
 Plantinga, AWitte, ALi, MHHarmon, AChoi, SKBanaszak Holl, MMOrr, BGBaker, JRSinniah, K Bioanalytical Screening of Riboflavin Antagonists for Targeted Drug Delivery - A Thermodynamic and Kinetic Study. ACS Med Chem Lett 2:363-367 (2011)  
Target
Name:
Riboflavin-binding protein
Synonyms:
RBP Riboflavin-binding protein, plasma form Riboflavin-binding protein, yolk minor form
Type:
PROTEIN
Mol. Mass.:
27203.20
Organism:
Gallus gallus
Description:
ChEMBL_800332
Residue:
238
  
Inhibitor
Name:
BDBM22985
Synonyms:
Aralen CHLOROQUINE PHOSPHATE Chloroquine med.21724, Compound 8 | {4-[(7-chloroquinolin-4-yl)amino]pentyl}diethylamine
Type:
Antimalarial
Emp. Form.:
C18H26ClN3
Mol. Mass.:
319.872
SMILES:
CCN(CC)CCCC(C)Nc1ccnc2cc(Cl)ccc12
: