Target
HTH-type transcriptional regulator EthR
Ligand
BDBM50343351
Substrate
Meas. Tech.
ChEMBL_800730 (CHEMBL1947973)
IC50
2000±n/a nM
Citation
 Flipo, MDesroses, MLecat-Guillet, NVillemagne, BBlondiaux, NLeroux, FPiveteau, CMathys, VFlament, MPSiepmann, JVilleret, VWohlkönig, AWintjens, RSoror, SHChristophe, TJeon, HKLocht, CBrodin, PDéprez, BBaulard, ARWilland, N Ethionamide boosters. 2. Combining bioisosteric replacement and structure-based drug design to solve pharmacokinetic issues in a series of potent 1,2,4-oxadiazole EthR inhibitors. J Med Chem 55:68-83 (2012)  
Target
Name:
HTH-type transcriptional regulator EthR
Synonyms:
ETHR_MYCTU Transcriptional repressor EthR (EthR) ethR
Type:
Protein
Mol. Mass.:
23751.94
Organism:
Mycobacterium tuberculosis
Description:
P9WMC1
Residue:
216
  
Inhibitor
Name:
BDBM50343351
Synonyms:
4,4,4-Trifluoro-1-[(R)-3-(3-thiophen-2-yl-1,2,4-oxadiazol-5-yl)-pyrrolidin-1-yl]-butan-1-one | CHEMBL1773975
Type:
Small organic molecule
Emp. Form.:
C14H14F3N3O2S
Mol. Mass.:
345.34
SMILES:
FC(F)(F)CCC(=O)N1CC[C@H](C1)c1nc(no1)-c1cccs1
: