Target
Multidrug resistance-associated protein 1
Ligand
BDBM50363095
Substrate
Meas. Tech.
ChEMBL_800770 (CHEMBL1948106)
IC50
>100000±n/a nM
Citation
 Pellicani, RZStefanachi, ANiso, MCarotti, ALeonetti, FNicolotti, OPerrone, RBerardi, FCellamare, SColabufo, NA Potent galloyl-based selective modulators targeting multidrug resistance associated protein 1 and P-glycoprotein. J Med Chem 55:424-36 (2012)  
Target
Name:
Multidrug resistance-associated protein 1
Synonyms:
7.6.2.2 ABCC1 ATP-binding cassette, sub-family C, member 1 isoform 1 LTC4 transporter MRP MRP1_HUMAN
Type:
Mol. Mass.:
171597.72
Organism:
Homo sapiens (Human)
Description:
P33527
Residue:
1531
  
Inhibitor
Name:
BDBM50363095
Synonyms:
CHEMBL1945310
Type:
Small organic molecule
Emp. Form.:
C22H22N3O6
Mol. Mass.:
424.426
SMILES:
COc1cc(cc(OC)c1OC)C(=O)Nc1ccc(cc1[N+]([O-])=O)-c1ccc[n+](C)c1
: