Target
Mitogen-activated protein kinase 10
Ligand
BDBM50363446
Substrate
Meas. Tech.
ChEMBL_800186 (CHEMBL1947748)
IC50
>1000±n/a nM
Citation
 Krenitsky, VPDelgado, MNadolny, LSahasrabudhe, KAyala, LClareen, SSHilgraf, RAlbers, RKois, AHughes, KWright, JNowakowski, JSudbeck, EGhosh, SBahmanyar, SChamberlain, PMuir, JCathers, BEGiegel, DXu, LCeleridad, MMoghaddam, MKhatsenko, OOmholt, PKatz, JPai, SFan, RTang, YShirley, MABenish, BBlease, KRaymon, HBhagwat, SHenderson, ICole, AGBennett, BSatoh, Y Aminopurine based JNK inhibitors for the prevention of ischemia reperfusion injury. Bioorg Med Chem Lett 22:1427-32 (2012)  
Target
Name:
Mitogen-activated protein kinase 10
Synonyms:
JNK3 MAP kinase p49 3F12 MK10_HUMAN Mitogen-activated protein kinase 10 (Stress-activated protein kinase JNK3) (c-Jun N-terminal kinase 3) (MAP kinase p49 3F12) PRKM10 Stress-activated protein kinase JNK3 | c-Jun N-terminal kinase 3 (JNK3)
Type:
Enzyme
Mol. Mass.:
52586.89
Organism:
Homo sapiens (Human)
Description:
Residue:
464
  
Inhibitor
Name:
BDBM50363446
Synonyms:
CHEMBL1946324
Type:
Small organic molecule
Emp. Form.:
C23H24N6O
Mol. Mass.:
400.4763
SMILES:
COc1ccc(Nc2ncc3nc(Nc4ccccc4)n(C4CCCC4)c3n2)cc1
: