Target
NAD-dependent protein deacetylase sirtuin-2
Ligand
BDBM50363783
Substrate
Meas. Tech.
ChEMBL_801933 (CHEMBL1947692)
IC50
4600±n/a nM
Citation
 McCarthy, ARPirrie, LHollick, JJRonseaux, SCampbell, JHiggins, MStaples, ODTran, FSlawin, AMLain, SWestwood, NJ Synthesis and biological characterisation of sirtuin inhibitors based on the tenovins. Bioorg Med Chem 20:1779-93 (2012)  
Target
Name:
NAD-dependent protein deacetylase sirtuin-2
Synonyms:
NAD-Dependent Deacetylase Sirtuin-2 NAD-dependent deacetylase sirtuin 3 SIR2-like SIR2L SIR2_HUMAN Sirtuin 2 (SIRT2)
Type:
Hydrolase
Mol. Mass.:
43172.62
Organism:
Homo sapiens (Human)
Description:
Residue:
389
  
Inhibitor
Name:
BDBM50363783
Synonyms:
CHEMBL1945265 | US9365508, 361a (3-Br, 4 tBu)
Type:
Small organic molecule
Emp. Form.:
C25H33BrN4O2S
Mol. Mass.:
533.524
SMILES:
CN(C)CCCCC(=O)Nc1ccc(NC(=S)NC(=O)c2ccc(c(Br)c2)C(C)(C)C)cc1
: