Target
Adenosine receptor A2a
Ligand
BDBM50119168
Substrate
Meas. Tech.
ChEMBL_805333 (CHEMBL1955226)
Ki
5.7±n/a nM
Citation
 Deflorian, FKumar, TSPhan, KGao, ZGXu, FWu, HKatritch, VStevens, RCJacobson, KA Evaluation of molecular modeling of agonist binding in light of the crystallographic structure of an agonist-bound A2A adenosine receptor. J Med Chem 55:538-52 (2012)  
Target
Name:
Adenosine receptor A2a
Synonyms:
A2A adenosine receptor (hA2A) ADENOSINE A2 ADORA2 Adenosine A2A receptor (A2AAR)
Type:
G Protein-Coupled Receptor (GPCR)
Mol. Mass.:
44716.46
Organism:
Homo sapiens (Human)
Description:
P29274
Residue:
412
  
Inhibitor
Name:
BDBM50119168
Synonyms:
(2R,3R,4S,5R)-2-(6-Amino-2-hex-1-ynyl-purin-9-yl)-5-hydroxymethyl-tetrahydro-furan-3,4-diol (2R,3R,4S,5R)-2-(6-amino-2-(hex-1-ynyl)-9H-purin-9-yl)-5-(hydroxymethyl)tetrahydrofuran-3,4-diol CHEMBL319387
Type:
Small organic molecule
Emp. Form.:
C16H21N5O4
Mol. Mass.:
347.369
SMILES:
CCCCC#Cc1nc(N)c2ncn([C@@H]3O[C@H](CO)[C@@H](O)[C@H]3O)c2n1
: