Target
Cannabinoid receptor 1
Ligand
BDBM50364091
Substrate
Meas. Tech.
ChEMBL_803201 (CHEMBL1954912)
EC50
>10000±n/a nM
Citation
 Gijsen, HJDe Cleyn, MASurkyn, MVan Lommen, GRVerbist, BMNijsen, MJMeert, TWauwe, JVAerssens, J 5-sulfonyl-benzimidazoles as selective CB2 agonists-part 2. Bioorg Med Chem Lett 22:547-52 (2011)  
Target
Name:
Cannabinoid receptor 1
Synonyms:
CANN6 CB-R CNR CNR1_HUMAN Cannabinoid receptor Cannabinoid receptor 1 (brain)
Type:
G Protein-Coupled Receptor (GPCR)
Mol. Mass.:
52868.96
Organism:
Homo sapiens (Human)
Description:
P21554
Residue:
472
  
Inhibitor
Name:
BDBM50364091
Synonyms:
CHEMBL1950838
Type:
Small organic molecule
Emp. Form.:
C23H32F3N3O3S
Mol. Mass.:
487.579
SMILES:
CC(=O)N1CCC(Cn2c(nc3cc(ccc23)S(=O)(=O)CCCC(F)(F)F)C(C)(C)C)CC1
: