Target
Endothelial lipase
Ligand
BDBM50364299
Substrate
Meas. Tech.
ChEMBL_804418 (CHEMBL1954845)
IC50
2900±n/a nM
Citation
 O'Connell, DPLeBlanc, DFCromley, DBillheimer, JRader, DJBachovchin, WW Design and synthesis of boronic acid inhibitors of endothelial lipase. Bioorg Med Chem Lett 22:1397-401 (2012)  
Target
Name:
Endothelial lipase
Synonyms:
EDL Endothelial cell-derived lipase LIPG
Type:
Protein
Mol. Mass.:
56805.62
Organism:
Homo sapiens (Human)
Description:
Q9Y5X9
Residue:
500
  
Inhibitor
Name:
BDBM50364299
Synonyms:
CHEMBL1952311
Type:
Small organic molecule
Emp. Form.:
C16H19BO3
Mol. Mass.:
270.131
SMILES:
CC1(C)OB(OC1(C)C)c1ccc(cc1)-c1ccoc1
: