Target
Lipoprotein lipase
Ligand
BDBM50364299
Substrate
Meas. Tech.
ChEMBL_804419 (CHEMBL1954846)
IC50
33000±n/a nM
Citation
 O'Connell, DPLeBlanc, DFCromley, DBillheimer, JRader, DJBachovchin, WW Design and synthesis of boronic acid inhibitors of endothelial lipase. Bioorg Med Chem Lett 22:1397-401 (2012)  
Target
Name:
Lipoprotein lipase
Synonyms:
LIPD LPL
Type:
PROTEIN
Mol. Mass.:
53173.96
Organism:
Homo sapiens (Human)
Description:
ChEMBL_1280894
Residue:
475
  
Inhibitor
Name:
BDBM50364299
Synonyms:
CHEMBL1952311
Type:
Small organic molecule
Emp. Form.:
C16H19BO3
Mol. Mass.:
270.131
SMILES:
CC1(C)OB(OC1(C)C)c1ccc(cc1)-c1ccoc1
: