Target
Midkine
Ligand
BDBM50364351
Substrate
Meas. Tech.
ChEMBL_805023 (CHEMBL1952884)
Kd
17.8±n/a nM
Citation
 Tamura, JTsutsumishita-Nakai, NNakao, YKawano, MKato, STakeda, NNadanaka, SKitagawa, H Synthesis and interaction with midkine of biotinylated chondroitin sulfate tetrasaccharides. Bioorg Med Chem Lett 22:1371-4 (2012)  
Target
Name:
Midkine
Synonyms:
ARAP MDK MK1 Midgestation and kidney protein Neurite outgrowth-promoting factor 2 | Neurite outgrowth-promoting protein
Type:
PROTEIN
Mol. Mass.:
15605.71
Organism:
Homo sapiens (Human)
Description:
ChEMBL_805023
Residue:
143
  
Inhibitor
Name:
BDBM50364351
Synonyms:
CHEMBL1950107
Type:
Small organic molecule
Emp. Form.:
C51H82N6O36S3
Mol. Mass.:
1451.411
SMILES:
CC(=O)N[C@@H]1[C@@H](O)[C@@H](OS([O-])(=O)=O)[C@@H](CO)O[C@H]1O[C@H]1[C@H](O)[C@@H](O)[C@H](O[C@@H]2[C@@H](NC(C)=O)[C@H](O[C@H]3[C@H](O)[C@@H](O)[C@H](OCCNC(=O)CCOCCOCCOCCOCCNC(=O)CCCC[C@@H]4SC[C@@H]5NC(=O)N[C@H]45)O[C@@H]3C(O)=O)O[C@H](CO)[C@@H]2OS([O-])(=O)=O)O[C@@H]1C(O)=O
: