Target
Legumain
Ligand
BDBM50364353
Substrate
Meas. Tech.
ChEMBL_805028 (CHEMBL1952889)
IC50
6.5±n/a nM
Citation
 Lee, JBogyo, M Synthesis and evaluation of aza-peptidyl inhibitors of the lysosomal asparaginyl endopeptidase, legumain. Bioorg Med Chem Lett 22:1340-3 (2012)  
Target
Name:
Legumain
Synonyms:
LGMN_MOUSE Prsc1 | asparaginyl endopeptidase
Type:
PROTEIN
Mol. Mass.:
49370.42
Organism:
Mus musculus
Description:
Residue:
435
  
Inhibitor
Name:
BDBM50364353
Synonyms:
CHEMBL1950109
Type:
Small organic molecule
Emp. Form.:
C19H29N5O7
Mol. Mass.:
439.4629
SMILES:
CCOC(=O)\C=C\C(=O)N(CC(N)=O)NC(=O)[C@@H]1CCCN1C(=O)[C@H](CC)NC(C)=O
: