Target
Mitogen-activated protein kinase 3
Ligand
BDBM50364378
Substrate
Meas. Tech.
ChEMBL_805189 (CHEMBL1955667)
IC50
480±n/a nM
Target
Name:
Mitogen-activated protein kinase 3
Synonyms:
ERK1 Extracellular signal-regulated kinase 1 MAP kinase ERK1 MAPK3/MAPK7 Mitogen-activated protein kinase PRKM3
Type:
Protein
Mol. Mass.:
43136.58
Organism:
Homo sapiens (Human)
Description:
curated by PDB 4QTB
Residue:
379
  
Inhibitor
Name:
BDBM50364378
Synonyms:
CHEMBL1950289
Type:
Small organic molecule
Emp. Form.:
C21H23F3N6O2
Mol. Mass.:
448.4415
SMILES:
O[C@H]1CC[C@@H](CC1)Nc1ncc2nc(Nc3c(F)cc(F)cc3F)n([C@H]3CCOC3)c2n1
: