Target
Type-1 angiotensin II receptor
Ligand
BDBM50364583
Substrate
Meas. Tech.
ChEMBL_802645 (CHEMBL1953053)
IC50
2.46±n/a nM
Citation
 Kim, TWYoo, BWLee, JKKim, JHLee, KTChi, YHLee, JY Synthesis and antihypertensive activity of pyrimidin-4(3H)-one derivatives as losartan analogue for new angiotensin II receptor type 1 (AT1) antagonists. Bioorg Med Chem Lett 22:1649-54 (2012)  
Target
Name:
Type-1 angiotensin II receptor
Synonyms:
AGTR1 ANGIOTENSIN AT1 Angiotensin II type 1a (AT-1a) receptor
Type:
Enzyme Catalytic Domain
Mol. Mass.:
41009.15
Organism:
RABBIT
Description:
ANGIOTENSIN AT1 AGTR1 RABBIT::P34976
Residue:
359
  
Inhibitor
Name:
BDBM50364583
Synonyms:
CHEMBL1951132
Type:
Small organic molecule
Emp. Form.:
C30H35N7O2
Mol. Mass.:
525.6446
SMILES:
CCCCc1nc(C)c(CC(=O)N2CCCCC2)c(=O)n1Cc1ccc(cc1)-c1ccccc1-c1nnn[nH]1
: