Target
Bromodomain-containing protein 4
Ligand
BDBM50365264
Substrate
Meas. Tech.
ChEMBL_806308 (CHEMBL1959072)
Kd
19±n/a nM
Citation
 Filippakopoulos, PPicaud, SFedorov, OKeller, MWrobel, MMorgenstern, OBracher, FKnapp, S Benzodiazepines and benzotriazepines as protein interaction inhibitors targeting bromodomains of the BET family. Bioorg Med Chem 20:1878-86 (2012)  
Target
Name:
Bromodomain-containing protein 4
Synonyms:
BRD4 Bromodomain-containing protein 4 (BRD4) Protein HUNK1
Type:
Protein
Mol. Mass.:
152264.84
Organism:
Homo sapiens (Human)
Description:
O60885
Residue:
1362
  
Inhibitor
Name:
BDBM50365264
Synonyms:
CHEMBL1738926
Type:
Small organic molecule
Emp. Form.:
C25H21N5O2
Mol. Mass.:
423.4665
SMILES:
Cc1nnc2[C@H](NC(=O)OCc3ccccc3)N=C(c3ccccc3)c3ccccc3-n12
: