Target
Potassium voltage-gated channel subfamily H member 2
Ligand
BDBM50222869
Substrate
Meas. Tech.
ChEMBL_806244 (CHEMBL1958785)
IC50
1622±n/a nM
Citation
 Hanrahan, PBell, JBottomley, GBradley, SClarke, PCurtis, EDavis, SDawson, GHorswill, JKeily, JMoore, GRasamison, CBloxham, J Substituted azaquinazolinones as modulators of GHSr-1a for the treatment of type II diabetes and obesity. Bioorg Med Chem Lett 22:2271-8 (2012)  
Target
Name:
Potassium voltage-gated channel subfamily H member 2
Synonyms:
1,3-beta-glucan synthase component GLS2 ERG Eag-related protein 1 Ether-a-go-go-related gene (HERG) Ether-a-go-go-related gene potassium channel 1 Ether-a-go-go-related gene potassium channel 1 (hERG1) Ether-a-go-go-related protein 1 H-ERG KCNH2 Potassium voltage-gated channel subfamily H member 2 (hERG) Voltage-gated potassium channel subunit Kv11.1 hERG Potassium Channel 1 | putative potassium channel subunit
Type:
Multi-pass membrane protein
Mol. Mass.:
126672.65
Organism:
Homo sapiens (Human)
Description:
Q12809
Residue:
1159
  
Inhibitor
Name:
BDBM50222869
Synonyms:
6-(4-fluorophenoxy)-3-{[(3S)-1-isopropylpiperidin-3-yl]methyl}-2-methylquinazolin-4(3H)-one | CHEMBL243001
Type:
Small organic molecule
Emp. Form.:
C24H28FN3O2
Mol. Mass.:
409.4964
SMILES:
CC(C)N1CCC[C@H](Cn2c(C)nc3ccc(Oc4ccc(F)cc4)cc3c2=O)C1
: