Target
cAMP and cAMP-inhibited cGMP 3',5'-cyclic phosphodiesterase 10A
Ligand
BDBM50365982
Substrate
Meas. Tech.
ChEMBL_807171 (CHEMBL1959835)
IC50
1.3±n/a nM
Citation
 Hu, EKunz, RKRumfelt, SChen, NBürli, RLi, CAndrews, KLZhang, JChmait, SKogan, JLindstrom, MHitchcock, SATreanor, J Discovery of potent, selective, and metabolically stable 4-(pyridin-3-yl)cinnolines as novel phosphodiesterase 10A (PDE10A) inhibitors. Bioorg Med Chem Lett 22:2262-5 (2012)  
Target
Name:
cAMP and cAMP-inhibited cGMP 3',5'-cyclic phosphodiesterase 10A
Synonyms:
3',5'-cyclic phosphodiesterase PDE10A Phosphodiesterase 10 (PDE10) | Phosphodiesterase 10A
Type:
Protein
Mol. Mass.:
88412.52
Organism:
Homo sapiens (Human)
Description:
Q9Y233
Residue:
1055
  
Inhibitor
Name:
BDBM50365982
Synonyms:
CHEMBL1956253
Type:
Small organic molecule
Emp. Form.:
C26H32N4O3
Mol. Mass.:
448.5573
SMILES:
COc1cc2nncc(-c3cnc(N4CCC(CC4)C(C)(C)O)c(c3)C3CC3)c2cc1OC
: