Target
Platelet-activating factor receptor
Ligand
BDBM50002823
Substrate
Meas. Tech.
ChEMBL_155141 (CHEMBL759831)
Ki
59±n/a nM
Citation
 Sahoo, SPGraham, DWActon, JBiftu, TBugianesi, RLGirotra, NNKuo, CPonpipom, MMDoebber, TWWu, MSHwang, SLam, MMacIntyre, DBach, TJLuell, SMeurer, RDavies, PAlberts, AWChabala, JC Synthesis and biological activity of MK 287 (L-680,573): a potent, specific and orally active paf receptor antagonist Bioorg Med Chem Lett 1:327-332 (1991)    Article 
Target
Name:
Platelet-activating factor receptor
Synonyms:
PAF Platelet activating factor PAFR PTAFR_HUMAN Platelet-activating factor receptor
Type:
Enzyme Catalytic Domain
Mol. Mass.:
39219.60
Organism:
Homo sapiens (Human)
Description:
PAF Platelet activating factor PTAFR HUMAN::P25105
Residue:
342
  
Inhibitor
Name:
BDBM50002823
Synonyms:
2-{3-Methoxy-2-propoxy-5-[(2S,5S)-5-(3,4,5-trimethoxy-phenyl)-tetrahydro-furan-2-yl]-benzenesulfonyl}-ethanol L-680573 | MK-287
Type:
Small organic molecule
Emp. Form.:
C25H34O9S
Mol. Mass.:
510.597
SMILES:
CCCOc1c(OC)cc(cc1S(=O)(=O)CCO)[C@@H]1CC[C@H](O1)c1cc(OC)c(OC)c(OC)c1
: