Target
Amine oxidase [flavin-containing] A
Ligand
BDBM50282505
Substrate
Meas. Tech.
ChEMBL_122946 (CHEMBL733231)
IC50
>10000±n/a nM
Citation
 Rendenbach-Muller, BSchlecker, RTraut, MWeifenbach, H Synthesis of coumarins as subtype-selective inhibitors of monoamine oxidase Bioorg Med Chem Lett 4:1195-1198 (1994)    Article 
Target
Name:
Amine oxidase [flavin-containing] A
Synonyms:
AOFA_RAT Amine oxidase [flavin-containing] A Monoamine Oxidase Type A (MAO-A) Monoamine oxidase A (MAO-A) Monoamine oxidase type A (MAOA)
Type:
Enzyme
Mol. Mass.:
59515.21
Organism:
Rattus norvegicus (rat)
Description:
Residue:
526
  
Inhibitor
Name:
BDBM50282505
Synonyms:
7-(4-Isopropyl-benzyloxy)-3,4-dimethyl-chromen-2-one | CHEMBL415992
Type:
Small organic molecule
Emp. Form.:
C21H22O3
Mol. Mass.:
322.3976
SMILES:
CC(C)c1ccc(COc2ccc3c(C)c(C)c(=O)oc3c2)cc1
: