Target
17-beta-hydroxysteroid dehydrogenase type 2
Ligand
BDBM50366340
Substrate
Meas. Tech.
ChEMBL_44 (CHEMBL615156)
Ki
250±n/a nM
Citation
 Auger, SLuu-The, VSam, KMPoirier, D 3-Hydroxy-19-nor-17-pregna-1,3,5(10)-triene-21,17-carbolactone as inhibitor of 17-hydroxysteroid dehydrogenase type 2 Bioorg Med Chem Lett 4:2045-2048 (1994)    Article 
Target
Name:
17-beta-hydroxysteroid dehydrogenase type 2
Synonyms:
17-beta-Hydroxysteroid Dehydrogenase 2 (17-beta-HSD2) 20-alpha-HSD EDH17B2 Estradiol 17-beta-dehydrogenase 2 (17beta-HSD2) Microsomal 17-beta-hydroxysteroid dehydrogenas Testosterone 17-beta-dehydrogenase
Type:
Oxidoreductase; single-pass type II membrane protein
Mol. Mass.:
42795.29
Organism:
Homo sapiens (Human)
Description:
Enzyme was partially purified from human placenta.
Residue:
387
  
Inhibitor
Name:
BDBM50366340
Synonyms:
CHEMBL514046
Type:
Small organic molecule
Emp. Form.:
C21H26O3
Mol. Mass.:
326.4293
SMILES:
C[C@]12CC[C@H]3[C@@H](CCc4cc(O)ccc34)[C@@H]1CC[C@@]21CCC(=O)O1
: