Target
Lysosomal alpha-glucosidase
Ligand
BDBM50283602
Substrate
Meas. Tech.
ChEMBL_215887 (CHEMBL820819)
IC50
51700±n/a nM
Citation
 Uchida, CKimura, HOgawa, S Potent glycosidase inhibitors, N-phenyl cyclic isourea derivatives of 5-amino- and 5-amino-1-C-(hydroxymethyl)-cyclopentane-1,2,3,4-tetraols Bioorg Med Chem Lett 4:2643-2648 (1994)    Article 
Target
Name:
Lysosomal alpha-glucosidase
Synonyms:
Alpha-glucosidase LYAG_BOVIN
Type:
PROTEIN
Mol. Mass.:
104738.88
Organism:
Bos taurus
Description:
ChEMBL_215887
Residue:
937
  
Inhibitor
Name:
BDBM50283602
Synonyms:
6a-Hydroxymethyl-2-phenylamino-4,5,6,6a-tetrahydro-3aH-cyclopentaoxazole-4,5,6-triol | CHEMBL86772
Type:
Small organic molecule
Emp. Form.:
C13H16N2O5
Mol. Mass.:
280.2765
SMILES:
OCC12OC(Nc3ccccc3)=NC1C(O)C(O)C2O
: