Target
Angiotensin-converting enzyme 2
Ligand
BDBM50283631
Substrate
Meas. Tech.
ChEMBL_35588 (CHEMBL876577)
IC50
147±n/a nM
Citation
 De Lombaert, STan, JStamford, LJSakane, YBerry, CGhai, RD Dual inhibition of neutral endopeptidase and angiotensin-converting enzyme by N-phosphonomethyl and N-carboxyalkyl dipeptides Bioorg Med Chem Lett 4:2715-2720 (1994)    Article 
Target
Name:
Angiotensin-converting enzyme 2
Synonyms:
ACEI-ACE2 | Angiotensin-converting enzyme
Type:
Mol. Mass.:
Description:
ASSAY_ID of EBI is 35589
Components:
This complex has 2 components.
Component 1
Name:
Angiotensin-converting enzyme
Synonyms:
ACE Angiotensin converting enzyme (ACE) Angiotensin-converting enzyme, soluble form CD_antigen=CD143 DCP1 Kininase II
Type:
Enzyme
Mol. Mass.:
149709.01
Organism:
Homo sapiens (Human)
Description:
Residue:
1306
  
Component 2
Name:
Angiotensin-converting enzyme 2
Synonyms:
ACE-related carboxypeptidase ACE2_HUMAN Angiotensin-converting enzyme homolog Metalloprotease MPROT15
Type:
Enzyme
Mol. Mass.:
92448.86
Organism:
Homo sapiens (Human)
Description:
Residue:
805
  
Inhibitor
Name:
BDBM50283631
Synonyms:
(S)-2-[(S)-3-Benzo[1,3]dioxol-5-yl-2-(phosphonomethyl-amino)-propionylamino]-3-biphenyl-4-yl-propionic acid | CHEMBL328463
Type:
Small organic molecule
Emp. Form.:
C26H27N2O8P
Mol. Mass.:
526.4749
SMILES:
OC(=O)[C@H](Cc1ccc(cc1)-c1ccccc1)NC(=O)[C@H](Cc1ccc2OCOc2c1)NCP(O)(O)=O
: