Target
Neprilysin
Ligand
BDBM50283631
Substrate
Meas. Tech.
ChEBML_144632
IC50
48±n/a nM
Citation
 De Lombaert, STan, JStamford, LJSakane, YBerry, CGhai, RD Dual inhibition of neutral endopeptidase and angiotensin-converting enzyme by N-phosphonomethyl and N-carboxyalkyl dipeptides Bioorg Med Chem Lett 4:2715-2720 (1994)    Article 
Target
Name:
Neprilysin
Synonyms:
Atriopeptidase CD_antigen=CD10 EPN MME NEP_HUMAN Neutral endopeptidase | Neutral endopeptidase 24.11
Type:
Enzyme
Mol. Mass.:
85505.38
Organism:
Homo sapiens (Human)
Description:
P08473
Residue:
750
  
Inhibitor
Name:
BDBM50283631
Synonyms:
(S)-2-[(S)-3-Benzo[1,3]dioxol-5-yl-2-(phosphonomethyl-amino)-propionylamino]-3-biphenyl-4-yl-propionic acid | CHEMBL328463
Type:
Small organic molecule
Emp. Form.:
C26H27N2O8P
Mol. Mass.:
526.4749
SMILES:
OC(=O)[C@H](Cc1ccc(cc1)-c1ccccc1)NC(=O)[C@H](Cc1ccc2OCOc2c1)NCP(O)(O)=O
: