Target
Neprilysin
Ligand
BDBM50283642
Substrate
Meas. Tech.
ChEBML_144632
IC50
2±n/a nM
Citation
 De Lombaert, STan, JStamford, LJSakane, YBerry, CGhai, RD Dual inhibition of neutral endopeptidase and angiotensin-converting enzyme by N-phosphonomethyl and N-carboxyalkyl dipeptides Bioorg Med Chem Lett 4:2715-2720 (1994)    Article 
Target
Name:
Neprilysin
Synonyms:
Atriopeptidase CD_antigen=CD10 EPN MME NEP_HUMAN Neutral endopeptidase | Neutral endopeptidase 24.11
Type:
Enzyme
Mol. Mass.:
85505.38
Organism:
Homo sapiens (Human)
Description:
P08473
Residue:
750
  
Inhibitor
Name:
BDBM50283642
Synonyms:
(S)-3-Biphenyl-4-yl-2-{(S)-3-methyl-2-[((R)-phosphonomethyl)-amino]-pentanoylamino}-propionic acid | CHEMBL90545
Type:
Small organic molecule
Emp. Form.:
C22H29N2O6P
Mol. Mass.:
448.4492
SMILES:
CC[C@@H](C)[C@H](NCP(O)(O)=O)C(=O)N[C@@H](Cc1ccc(cc1)-c1ccccc1)C(O)=O
: