Target
Neprilysin
Ligand
BDBM50283634
Substrate
Meas. Tech.
ChEBML_144632
IC50
9±n/a nM
Citation
 De Lombaert, STan, JStamford, LJSakane, YBerry, CGhai, RD Dual inhibition of neutral endopeptidase and angiotensin-converting enzyme by N-phosphonomethyl and N-carboxyalkyl dipeptides Bioorg Med Chem Lett 4:2715-2720 (1994)    Article 
Target
Name:
Neprilysin
Synonyms:
Atriopeptidase CD_antigen=CD10 EPN MME NEP_HUMAN Neutral endopeptidase | Neutral endopeptidase 24.11
Type:
Enzyme
Mol. Mass.:
85505.38
Organism:
Homo sapiens (Human)
Description:
P08473
Residue:
750
  
Inhibitor
Name:
BDBM50283634
Synonyms:
(S)-3-(1H-Indol-3-yl)-2-[(S)-3-methyl-2-(phosphonomethyl-amino)-butyrylamino]-propionic acid | CHEMBL92949
Type:
Small organic molecule
Emp. Form.:
C17H24N3O6P
Mol. Mass.:
397.3627
SMILES:
CC(C)[C@H](NCP(O)(O)=O)C(=O)N[C@@H](Cc1c[nH]c2ccccc12)C(O)=O
: