Target
Neprilysin
Ligand
BDBM50283655
Substrate
Meas. Tech.
ChEBML_144632
IC50
338±n/a nM
Citation
 De Lombaert, STan, JStamford, LJSakane, YBerry, CGhai, RD Dual inhibition of neutral endopeptidase and angiotensin-converting enzyme by N-phosphonomethyl and N-carboxyalkyl dipeptides Bioorg Med Chem Lett 4:2715-2720 (1994)    Article 
Target
Name:
Neprilysin
Synonyms:
Atriopeptidase CD_antigen=CD10 EPN MME NEP_HUMAN Neutral endopeptidase | Neutral endopeptidase 24.11
Type:
Enzyme
Mol. Mass.:
85505.38
Organism:
Homo sapiens (Human)
Description:
P08473
Residue:
750
  
Inhibitor
Name:
BDBM50283655
Synonyms:
(S)-3-Biphenyl-4-yl-2-[(S)-3-(4-chloro-phenyl)-2-(phosphonomethyl-amino)-propionylamino]-propionic acid | CHEMBL329464
Type:
Small organic molecule
Emp. Form.:
C25H26ClN2O6P
Mol. Mass.:
516.911
SMILES:
OC(=O)[C@H](Cc1ccc(cc1)-c1ccccc1)NC(=O)[C@H](Cc1ccc(Cl)cc1)NCP(O)(O)=O
: