Target
Neprilysin
Ligand
BDBM50283657
Substrate
Meas. Tech.
ChEBML_144632
IC50
34±n/a nM
Citation
 De Lombaert, STan, JStamford, LJSakane, YBerry, CGhai, RD Dual inhibition of neutral endopeptidase and angiotensin-converting enzyme by N-phosphonomethyl and N-carboxyalkyl dipeptides Bioorg Med Chem Lett 4:2715-2720 (1994)    Article 
Target
Name:
Neprilysin
Synonyms:
Atriopeptidase CD_antigen=CD10 EPN MME NEP_HUMAN Neutral endopeptidase | Neutral endopeptidase 24.11
Type:
Enzyme
Mol. Mass.:
85505.38
Organism:
Homo sapiens (Human)
Description:
P08473
Residue:
750
  
Inhibitor
Name:
BDBM50283657
Synonyms:
(S)-3-Biphenyl-4-yl-2-[(S)-2-cyclohexyl-2-(phosphonomethyl-amino)-acetylamino]-propionic acid | CHEMBL92638
Type:
Small organic molecule
Emp. Form.:
C24H31N2O6P
Mol. Mass.:
474.4865
SMILES:
OC(=O)[C@H](Cc1ccc(cc1)-c1ccccc1)NC(=O)[C@@H](NCP(O)(O)=O)C1CCCCC1
: