Target
Neprilysin
Ligand
BDBM50283654
Substrate
Meas. Tech.
ChEBML_144632
IC50
>1000±n/a nM
Citation
 De Lombaert, STan, JStamford, LJSakane, YBerry, CGhai, RD Dual inhibition of neutral endopeptidase and angiotensin-converting enzyme by N-phosphonomethyl and N-carboxyalkyl dipeptides Bioorg Med Chem Lett 4:2715-2720 (1994)    Article 
Target
Name:
Neprilysin
Synonyms:
Atriopeptidase CD_antigen=CD10 EPN MME NEP_HUMAN Neutral endopeptidase | Neutral endopeptidase 24.11
Type:
Enzyme
Mol. Mass.:
85505.38
Organism:
Homo sapiens (Human)
Description:
P08473
Residue:
750
  
Inhibitor
Name:
BDBM50283654
Synonyms:
(S)-3-Biphenyl-4-yl-2-[(S)-3-(1H-imidazol-4-yl)-2-(phosphonomethyl-amino)-propionylamino]-propionic acid | CHEMBL315669
Type:
Small organic molecule
Emp. Form.:
C22H25N4O6P
Mol. Mass.:
472.4309
SMILES:
OC(=O)[C@H](Cc1ccc(cc1)-c1ccccc1)NC(=O)[C@H](Cc1cnc[nH]1)NCP(O)(O)=O
: