Target
Neprilysin
Ligand
BDBM50283648
Substrate
Meas. Tech.
ChEBML_144632
IC50
26±n/a nM
Citation
 De Lombaert, STan, JStamford, LJSakane, YBerry, CGhai, RD Dual inhibition of neutral endopeptidase and angiotensin-converting enzyme by N-phosphonomethyl and N-carboxyalkyl dipeptides Bioorg Med Chem Lett 4:2715-2720 (1994)    Article 
Target
Name:
Neprilysin
Synonyms:
Atriopeptidase CD_antigen=CD10 EPN MME NEP_HUMAN Neutral endopeptidase | Neutral endopeptidase 24.11
Type:
Enzyme
Mol. Mass.:
85505.38
Organism:
Homo sapiens (Human)
Description:
P08473
Residue:
750
  
Inhibitor
Name:
BDBM50283648
Synonyms:
(S)-2-[(S)-3-Methyl-2-(phosphonomethyl-amino)-butyrylamino]-4-phenyl-butyric acid | CHEMBL93562
Type:
Small organic molecule
Emp. Form.:
C16H25N2O6P
Mol. Mass.:
372.3533
SMILES:
CC(C)[C@H](NCP(O)(O)=O)C(=O)N[C@@H](CCc1ccccc1)C(O)=O
: