Target
B2 bradykinin receptor
Ligand
BDBM50286385
Substrate
Meas. Tech.
ChEBML_40427
Ki
3440±n/a nM
Citation
 Salvino, JMSeoane, PRDouty, BDAwad, MAHoyer, DRoss, TMDolle, REHouck, WTFaunce, DMSawutz, DG Structure activity relationships of non-peptide bradykinin B2 receptor antagonists Bioorg Med Chem Lett 5:357-362 (1995)    Article 
Target
Name:
B2 bradykinin receptor
Synonyms:
B2 BRADYKININ B2R BK-2 receptor BKRB2_HUMAN | Bradykinin B2 receptor
Type:
Enzyme Catalytic Domain
Mol. Mass.:
44467.17
Organism:
Homo sapiens (Human)
Description:
B2 BRADYKININ BDKRB2 HUMAN::P30411
Residue:
391
  
Inhibitor
Name:
BDBM50286385
Synonyms:
2-(N',N''-Dicyclohexyl-guanidino)-2-naphthalen-2-yl-N-[4-(tributyl-lambda*5*-phosphanylmethyl)-phenyl]-acetamide; chloride | CHEMBL554254
Type:
Small organic molecule
Emp. Form.:
C44H66N4OP
Mol. Mass.:
697.9943
SMILES:
[#6]-[#6]-[#6]-[#6][P+]([#6]-[#6]-[#6]-[#6])([#6]-[#6]-[#6]-[#6])[#6]-c1ccc(-[#7]-[#6](=O)-[#6](\[#7]=[#6](\[#7]-[#6]-2-[#6]-[#6]-[#6]-[#6]-[#6]-2)-[#7]-[#6]-2-[#6]-[#6]-[#6]-[#6]-[#6]-2)-c2ccc3ccccc3c2)cc1
: