Target
Neprilysin
Ligand
BDBM50287148
Substrate
Meas. Tech.
ChEBML_144316
IC50
10000±n/a nM
Citation
 Lloyd, JSchmidt, JBHunt, JTBarrish, JCLittle, DKTymiak, AA Solid phase synthesis of phosphinic acid endothelin converting enzyme inhibitors Bioorg Med Chem Lett 6:1323-1326 (1996)    Article 
Target
Name:
Neprilysin
Synonyms:
Atriopeptidase CD_antigen=CD10 EPN MME NEP_HUMAN Neutral endopeptidase | Neutral endopeptidase 24.11
Type:
Enzyme
Mol. Mass.:
85505.38
Organism:
Homo sapiens (Human)
Description:
P08473
Residue:
750
  
Inhibitor
Name:
BDBM50287148
Synonyms:
2-{2-Benzyl-3-[((R)-1-benzyloxycarbonylamino-2-phenyl-ethyl)-hydroxy-phosphinoyl]-propionylamino}-3-(1H-imidazol-4-yl)-propionic acid | CHEMBL26703
Type:
Small organic molecule
Emp. Form.:
C32H35N4O7P
Mol. Mass.:
618.6167
SMILES:
OC(=O)C(Cc1cnc[nH]1)NC(=O)C(Cc1ccccc1)CP(O)(=O)[C@H](Cc1ccccc1)NC(=O)OCc1ccccc1
: