Target
Gag-Pol polyprotein [489-587]
Ligand
BDBM50288179
Substrate
Meas. Tech.
ChEBML_157564
Ki
4±n/a nM
Citation
 Abbenante, GBergman, DBrinkworth, RMarch, DReid, RHunt, PJames, IDancer, RGarnham, BStoermer, MFairlie, D Structure-activity relationships for macrocyclic peptidomimetic inhibitors of HIV-1 protease Bioorg Med Chem Lett 6:2531-2536 (1996)    Article 
Target
Name:
Gag-Pol polyprotein [489-587]
Synonyms:
Human immunodeficiency virus type 1 protease Pol polyprotein | gag-pol
Type:
Enzyme Subunit
Mol. Mass.:
10781.16
Organism:
Human immunodeficiency virus type 1
Description:
P04585[489-587]
Residue:
99
  
Inhibitor
Name:
BDBM50288179
Synonyms:
1-{3-[2-(2-Acetylamino-4-methyl-pentanoylamino)-1-carbamoyl-2-oxo-ethylamino]-2-hydroxy-4-phenyl-butyl}-pyrrolidine-2-carboxylic acid [1-(1-carbamoyl-2-methyl-propylcarbamoyl)-2-methyl-butyl]-amide | CHEMBL316144
Type:
Small organic molecule
Emp. Form.:
C30H43N3O6S
Mol. Mass.:
573.744
SMILES:
CC(C)CCN(C[C@@H](O)[C@H]1Cc2ccc(OCCCC(=O)N[C@@H](C(C)C)C(=O)N1)cc2)S(=O)(=O)c1ccccc1
: