Target
Gag-Pol polyprotein [489-587]
Ligand
BDBM50366456
Substrate
Meas. Tech.
ChEBML_157564
Ki
4±n/a nM
Citation
 Abbenante, GBergman, DBrinkworth, RMarch, DReid, RHunt, PJames, IDancer, RGarnham, BStoermer, MFairlie, D Structure-activity relationships for macrocyclic peptidomimetic inhibitors of HIV-1 protease Bioorg Med Chem Lett 6:2531-2536 (1996)    Article 
Target
Name:
Gag-Pol polyprotein [489-587]
Synonyms:
Human immunodeficiency virus type 1 protease Pol polyprotein | gag-pol
Type:
Enzyme Subunit
Mol. Mass.:
10781.16
Organism:
Human immunodeficiency virus type 1
Description:
P04585[489-587]
Residue:
99
  
Inhibitor
Name:
BDBM50366456
Synonyms:
CHEMBL1790652
Type:
Small organic molecule
Emp. Form.:
C37H57N9O10
Mol. Mass.:
787.9028
SMILES:
CC[C@H](C)[C@H](NC(=O)[C@@H]1CCCN1CC(O)[C@H]1Cc2ccc(OCC(=O)N[C@H](CCC(N)=O)C(=O)N[C@@H](CC(N)=O)C(=O)N1)cc2)C(=O)N[C@@H](C(C)C)C(N)=O
: