Target
Gag-Pol polyprotein [489-587]
Ligand
BDBM50366461
Substrate
Meas. Tech.
ChEBML_157564
Ki
3±n/a nM
Citation
 Abbenante, GBergman, DBrinkworth, RMarch, DReid, RHunt, PJames, IDancer, RGarnham, BStoermer, MFairlie, D Structure-activity relationships for macrocyclic peptidomimetic inhibitors of HIV-1 protease Bioorg Med Chem Lett 6:2531-2536 (1996)    Article 
Target
Name:
Gag-Pol polyprotein [489-587]
Synonyms:
Human immunodeficiency virus type 1 protease Pol polyprotein | gag-pol
Type:
Enzyme Subunit
Mol. Mass.:
10781.16
Organism:
Human immunodeficiency virus type 1
Description:
P04585[489-587]
Residue:
99
  
Inhibitor
Name:
BDBM50366461
Synonyms:
CHEMBL1790234
Type:
Small organic molecule
Emp. Form.:
C38H55N5O7
Mol. Mass.:
693.8726
SMILES:
CC[C@@H](C)[C@@H]1NC(=O)[C@H](Cc2ccc(OCCCNC1=O)cc2)NC[C@@H](O)[C@@H]1Cc2ccc(OCCCCC(=O)N[C@@H](C(C)C)C(=O)N1)cc2
: