Target
Plasminogen
Ligand
BDBM50126700
Substrate
Meas. Tech.
ChEBML_155257
pH
7.5±n/a
Ki
>500000±n/a nM
Comments
extracted
Citation
 von der Saal, WKucznierz, RLeinert, HEngh, RA DERIVATIVES OF 4-AMINO-PYRIDINE AS SELECTIVE THROMBIN INHIBITORS Bioorg Med Chem Lett 7:1283-1288 (1997)    Article 
Target
Name:
Plasminogen
Synonyms:
Activation peptide PLG Plasmin Plasmin heavy chain A, short form | Plasmin light chain B
Type:
Enzyme
Mol. Mass.:
90579.18
Organism:
Homo sapiens (Human)
Description:
Residue:
810
  
Inhibitor
Name:
BDBM50126700
Synonyms:
4-Chloro-N-{3-[2-(pyridin-4-ylamino)-ethoxy]-phenyl}-benzenesulfonamide | CHEMBL23252
Type:
Small organic molecule
Emp. Form.:
C19H18ClN3O3S
Mol. Mass.:
403.883
SMILES:
Clc1ccc(cc1)S(=O)(=O)Nc1cccc(OCCNc2ccncc2)c1
: