Target
Plasminogen
Ligand
BDBM10458
Substrate
Meas. Tech.
ChEBML_155257
pH
7.5±n/a
Ki
>2000000±n/a nM
Comments
extracted
Citation
 von der Saal, WKucznierz, RLeinert, HEngh, RA DERIVATIVES OF 4-AMINO-PYRIDINE AS SELECTIVE THROMBIN INHIBITORS Bioorg Med Chem Lett 7:1283-1288 (1997)    Article 
Target
Name:
Plasminogen
Synonyms:
Activation peptide PLG Plasmin Plasmin heavy chain A, short form | Plasmin light chain B
Type:
Enzyme
Mol. Mass.:
90579.18
Organism:
Homo sapiens (Human)
Description:
Residue:
810
  
Inhibitor
Name:
BDBM10458
Synonyms:
4-AP CHEMBL284348 pyridin-4-amine
Type:
Small organic molecule
Emp. Form.:
C5H6N2
Mol. Mass.:
94.1145
SMILES:
Nc1ccncc1
: