Target
Plasminogen
Ligand
BDBM50289379
Substrate
Meas. Tech.
ChEBML_155257
pH
7.5±n/a
Ki
>500000±n/a nM
Comments
extracted
Citation
 von der Saal, WKucznierz, RLeinert, HEngh, RA DERIVATIVES OF 4-AMINO-PYRIDINE AS SELECTIVE THROMBIN INHIBITORS Bioorg Med Chem Lett 7:1283-1288 (1997)    Article 
Target
Name:
Plasminogen
Synonyms:
Activation peptide PLG Plasmin Plasmin heavy chain A, short form | Plasmin light chain B
Type:
Enzyme
Mol. Mass.:
90579.18
Organism:
Homo sapiens (Human)
Description:
Residue:
810
  
Inhibitor
Name:
BDBM50289379
Synonyms:
CHEMBL23243 | Pyridin-4-yl-(2-m-tolyloxy-ethyl)-amine
Type:
Small organic molecule
Emp. Form.:
C14H16N2O
Mol. Mass.:
228.2896
SMILES:
Cc1cccc(OCCNc2ccncc2)c1
: