Target
Beta-mannosidase
Ligand
BDBM50070028
Substrate
Meas. Tech.
ChEBML_41367
Ki
10000±n/a nM
Citation
 Therisod, HLetourneux, YTherisod, M A new strong inhibitor of beta-mannosidase. Bioorg Med Chem Lett 8:371-2 (1999)  
Target
Name:
Beta-mannosidase
Synonyms:
Lysosomal beta A mannosidase MANBA Mannanase | Mannase
Type:
PROTEIN
Mol. Mass.:
100878.33
Organism:
Homo sapiens (Human)
Description:
ChEMBL_41367
Residue:
879
  
Inhibitor
Name:
BDBM50070028
Synonyms:
3,4,5-Trihydroxy-6-hydroxymethyl-tetrahydro-pyran-2-one O-(2,4-dinitro-phenyl)-oxime | CHEMBL62534
Type:
Small organic molecule
Emp. Form.:
C12H13N3O10
Mol. Mass.:
359.2457
SMILES:
OCC1[O+]=C([N-]Oc2ccc(cc2[N+]([O-])=O)[N+]([O-])=O)C(O)C(O)C1O
: