Target
Cathepsin B
Ligand
BDBM50080206
Substrate
Meas. Tech.
ChEMBL_47387 (CHEMBL872428)
Ki
120±n/a nM
Citation
 Peet, NPKim, HOMarquart, ALAngelastro, MRNieduzak, TRWhite, JNFriedrich, DFlynn, GAWebster, MEVaz, RJLinnik, MDKoehl, JRMehdi, SBey, PEmary, BHwang, KK Hydroxyoxazolidines as alpha-aminoacetaldehye equivalents: novel inhibitors of calpain. Bioorg Med Chem Lett 9:2365-70 (1999)  
Target
Name:
Cathepsin B
Synonyms:
BCSB CTSB Cathepsin B1
Type:
Enzyme
Mol. Mass.:
36657.87
Organism:
Bos taurus (bovine)
Description:
Bovine spleen CB was purchased from Sigma Co. (USA).
Residue:
335
  
Inhibitor
Name:
BDBM50080206
Synonyms:
CHEMBL311735 | [1-((4S,5R)-4-Benzyl-5-hydroxy-oxazolidine-3-carbonyl)-2-methyl-propyl]-carbamic acid benzyl ester
Type:
Small organic molecule
Emp. Form.:
C23H28N2O5
Mol. Mass.:
412.4788
SMILES:
CC(C)C(NC(=O)OCc1ccccc1)C(=O)N1CO[C@@H](O)[C@@H]1Cc1ccccc1
: