Target
Growth hormone secretagogue receptor type 1
Ligand
BDBM50083974
Substrate
Meas. Tech.
ChEBML_70348
IC50
3000±n/a nM
Citation
 Ye, ZGao, YBakshi, RKChen, MHRohrer, SPFeighner, SDPong, SSHoward, ADBlake, ABirzin, ETLocco, LParmar, RMChan, WWSchaeffer, JMSmith, RGPatchett, AANargund, RP Modeling directed design and biological evaluation of quinazolinones as non-peptidic growth hormone secretagogues. Bioorg Med Chem Lett 10:5-8 (2000)  
Target
Name:
Growth hormone secretagogue receptor type 1
Synonyms:
GH-releasing peptide receptor GHS-R GHSR_HUMAN Ghrelin receptor | Ghrelin receptor 1a (GHS-R1a)
Type:
Receptor
Mol. Mass.:
41334.57
Organism:
Homo sapiens (Human)
Description:
Receptor binding studies use plasma membranes from LLC PK-1 cells transiently transfected with hGHSR1a.
Residue:
366
  
Inhibitor
Name:
BDBM50083974
Synonyms:
2-Amino-N-[(R)-2-((R)-3a-benzyl-2-methyl-3-oxo-2,3,3a,4,6,7-hexahydro-pyrazolo[4,3-c]pyridin-5-yl)-1-benzyloxymethyl-2-oxo-ethyl]-2-methyl-propionamide CP-424391-18
Type:
Small organic molecule
Emp. Form.:
C28H35N5O4
Mol. Mass.:
505.6086
SMILES:
CN1N=C2CCN(C[C@@]2(Cc2ccccc2)C1=O)C(=O)[C@@H](COCc1ccccc1)NC(=O)C(C)(C)N
: